t,c-ONONO

Vibrational and/or electronic energy levels

Data compiled by: Marilyn E. Jacox

State:   X

Vib.
sym.
 No.   Approximate
 type of mode
 cm-1   Med.   Method   References

a' 1 t-N=O stretch 1704.5 Ar IR Wang and Qin, 1998
-I Lee, Lee, et al., 1998
2 c-N=O stretch 1665.7 Ar IR Wang and Qin, 1998
-I Lee, Lee, et al., 1998
3 ONO a-deform. 877.8 Ar IR Wang and Qin, 1998
-I Lee, Lee, et al., 1998
6 N..O stretch 243.0 Ar IR Wang and Qin, 1998
-I Lee, Lee, et al., 1998

Additional references: Jacox, 2003, page 300

References

Wang and Qin, 1998
Wang, X.; Qin, Q.-Z., Spectrochim. Acta, 1998, 54A, 575. [all data]

-I Lee, Lee, et al., 1998
-I Lee, C.; Lee, Y.-P.; Wang, X.; Qin, Q.-Z., Isomers of N[sub 2]O[sub 3]: Observation of trans-cis N[sub 2]O[sub 3] in solid Ar, J. Chem. Phys., 1998, 109, 23, 10446, https://doi.org/10.1063/1.477700 . [all data]

Jacox, 2003
Jacox, M.E., Vibrational and electronic energy levels of polyatomic transient molecules: supplement B, J. Phys. Chem. Ref. Data, 2003, 32, 1, 1-441, https://doi.org/10.1063/1.1497629 . [all data]