NZrO

Vibrational and/or electronic energy levels

Data compiled by: Marilyn E. Jacox

State:   X

Vib.
sym.
 No.   Approximate
 type of mode
 cm-1   Med.   Method   References

a' 1 ZrO stretch 861.3 Ne IR Andrews and Wang, 2002
1 ZrO stretch 844.2 Ar IR Kushto and Andrews, 1999
3 ZrN stretch 687.9 Ne IR Andrews and Wang, 2002
3 ZrN stretch 673.3 Ar IR Kushto and Andrews, 1999

Additional references: Jacox, 2003, page 88

References

Andrews and Wang, 2002
Andrews, L.; Wang, X., Infrared Spectra and Density Functional Calculations for Early First-Row Transition Metal Nitrosyls in Solid Neon, J. Phys. Chem. A, 2002, 106, 7, 1196, https://doi.org/10.1021/jp013443d . [all data]

Kushto and Andrews, 1999
Kushto, G.P.; Andrews, L., Infrared Spectroscopic and Density Functional Theoretical Investigation of the Reaction Products of Laser-Ablated Zr, Hf, and Th Atoms with Nitric Oxide, J. Phys. Chem. A, 1999, 103, 25, 4836, https://doi.org/10.1021/jp9905732 . [all data]

Jacox, 2003
Jacox, M.E., Vibrational and electronic energy levels of polyatomic transient molecules: supplement B, J. Phys. Chem. Ref. Data, 2003, 32, 1, 1-441, https://doi.org/10.1063/1.1497629 . [all data]