NVO

Vibrational and/or electronic energy levels

Data compiled by: Marilyn E. Jacox

State:   X

Vib.
sym.
 No.   Approximate
 type of mode
 cm-1   Med.   Method   References

a' 1 VN stretch 1007.0 Ne IR Andrews and Wang, 2002
1 VN stretch 998.1 Ar IR Zhou and Andrews, 1999
3 VO stretch 912.0 Ne IR Andrews and Wang, 2002
3 VO stretch 906.4 Ar IR Zhou and Andrews, 1999

Additional references: Jacox, 2003, page 88

References

Andrews and Wang, 2002
Andrews, L.; Wang, X., Infrared Spectra and Density Functional Calculations for Early First-Row Transition Metal Nitrosyls in Solid Neon, J. Phys. Chem. A, 2002, 106, 7, 1196, https://doi.org/10.1021/jp013443d . [all data]

Zhou and Andrews, 1999
Zhou, M.; Andrews, L., Reactions of Laser-Ablated Vanadium Atoms with Nitric Oxide. Infrared Spectra and Density Functional Calculations on NVO, V-η, J. Phys. Chem. A, 1999, 103, 4, 478, https://doi.org/10.1021/jp983413j . [all data]

Jacox, 2003
Jacox, M.E., Vibrational and electronic energy levels of polyatomic transient molecules: supplement B, J. Phys. Chem. Ref. Data, 2003, 32, 1, 1-441, https://doi.org/10.1063/1.1497629 . [all data]