cyc-VNO+

Vibrational and/or electronic energy levels

Data compiled by: Marilyn E. Jacox

State:   X

Vib.
sym.
 No.   Approximate
 type of mode
 cm-1   Med.   Method   References

a' 1 NO stretch 1146.5 Ne IR Andrews and Wang, 2002
1 NO stretch 1143.7 Ne IR Andrews and Wang, 2002
1 NO stretch 1139.5 Ar IR Andrews and Wang, 2002
1 NO stretch 1137.0 Ar IR Andrews and Wang, 2002

Additional references: Jacox, 2003, page 76

References

Andrews and Wang, 2002
Andrews, L.; Wang, X., Infrared Spectra and Density Functional Calculations for Early First-Row Transition Metal Nitrosyls in Solid Neon, J. Phys. Chem. A, 2002, 106, 7, 1196, https://doi.org/10.1021/jp013443d . [all data]

Jacox, 2003
Jacox, M.E., Vibrational and electronic energy levels of polyatomic transient molecules: supplement B, J. Phys. Chem. Ref. Data, 2003, 32, 1, 1-441, https://doi.org/10.1063/1.1497629 . [all data]