UNO

Vibrational and/or electronic energy levels

Data compiled by: Marilyn E. Jacox

State:   X

Vib.
sym.
 No.   Approximate
 type of mode
 cm-1   Med.   Method   References

NO stretch 1757.3 Ar IR Kushto, Souter, et al., 1997
NO stretch 1749.2 Ar IR Kushto, Souter, et al., 1997

Additional references: Jacox, 1998, page 172

References

Kushto, Souter, et al., 1997
Kushto, G.P.; Souter, P.F.; Andrews, L.; Neurock, M., A matrix isolation FT--IR and quasirelativistic density functional theory investigation of the reaction products of laser-ablated uranium atoms with NO, NO[sub 2] and N[sub 2]O, J. Chem. Phys., 1997, 106, 14, 5894, https://doi.org/10.1063/1.473254 . [all data]

Jacox, 1998
Jacox, M.E., Vibrational and electronic energy levels of polyatomic transient molecules: supplement A, J. Phys. Chem. Ref. Data, 1998, 27, 2, 115-393, https://doi.org/10.1063/1.556017 . [all data]