NThO

Vibrational and/or electronic energy levels

Data compiled by: Marilyn E. Jacox

State:   X

Vib.
sym.
 No.   Approximate
 type of mode
 cm-1   Med.   Method   References

a' 1 ThO stretch 784.2 Ne IR Zhou and Andrews, 1999
1 ThO stretch 760.3 Ar IR Kushto and Andrews, 1999
3 ThN stretch 709.8 Ne IR Zhou and Andrews, 1999
3 ThN stretch 697.3 Ar IR Kushto and Andrews, 1999

Additional references: Jacox, 2003, page 96

References

Zhou and Andrews, 1999
Zhou, M.; Andrews, L., Infrared spectra and pseudopotential calculations for NUO[sup +], NUO, and NThO in solid neon, J. Chem. Phys., 1999, 111, 24, 11044, https://doi.org/10.1063/1.480463 . [all data]

Kushto and Andrews, 1999
Kushto, G.P.; Andrews, L., Infrared Spectroscopic and Density Functional Theoretical Investigation of the Reaction Products of Laser-Ablated Zr, Hf, and Th Atoms with Nitric Oxide, J. Phys. Chem. A, 1999, 103, 25, 4836, https://doi.org/10.1021/jp9905732 . [all data]

Jacox, 2003
Jacox, M.E., Vibrational and electronic energy levels of polyatomic transient molecules: supplement B, J. Phys. Chem. Ref. Data, 2003, 32, 1, 1-441, https://doi.org/10.1063/1.1497629 . [all data]