NOsO

Vibrational and/or electronic energy levels

Data compiled by: Marilyn E. Jacox

State:   X

Vib.
sym.
 No.   Approximate
 type of mode
 cm-1   Med.   Method   References

a' 1 OsN stretch 1057.6 Ne IR Citra and Andrews, 2000
1 OsN stretch 1052.0 Ar IR Citra and Andrews, 2000
3 OsO stretch 892.0 Ne IR Citra and Andrews, 2000
3 OsO stretch 886.9 Ar IR Citra and Andrews, 2000

Additional references: Jacox, 2003, page 91

References

Citra and Andrews, 2000
Citra, A.; Andrews, L., Reactions of Laser-Ablated Osmium and Ruthenium Atoms with Nitric Oxide in Neon and Argon. Matrix Infrared Spectra and Density Functional Calculations of Os(NO), J. Phys. Chem. A, 2000, 104, 38, 8689, https://doi.org/10.1021/jp001700t . [all data]

Jacox, 2003
Jacox, M.E., Vibrational and electronic energy levels of polyatomic transient molecules: supplement B, J. Phys. Chem. Ref. Data, 2003, 32, 1, 1-441, https://doi.org/10.1063/1.1497629 . [all data]