MnO3-

Vibrational and/or electronic energy levels

Data compiled by: Marilyn E. Jacox

State:   ?

 Energy
 (cm-1
 Med.   Transition   λmin
 (nm)
 λmax
 (nm)

References

Td = 26910 ± 80 gas Gutsev, Rao, et al., 2000

Gutsev, Rao, et al., 2000
Gutsev, G.L.; Rao, B.K.; Jena, P.; Li, X.; Wang, L.-X., Experimental and theoretical study of the photoelectron spectra of MnO[sub x][sup -](x=1--3) clusters, J. Chem. Phys., 2000, 113, 4, 1473, https://doi.org/10.1063/1.481964 . [all data]