(cyc-O2Mn)O

Vibrational and/or electronic energy levels

Data compiled by: Marilyn E. Jacox

State:   X

Vib.
sym.
 No.   Approximate
 type of mode
 cm-1   Med.   Method   References

1 OO stretch 1092.2 Ar IR Chertihin and Andrews, 1997
MnO stretch 886.9 Ar IR Chertihin and Andrews, 1997

Additional references: Jacox, 2003, page 226

References

Chertihin and Andrews, 1997
Chertihin, G.V.; Andrews, L., Reactions of Laser-Ablated Manganese Atoms with Dioxygen. Infrared Spectra of MnO, OMnO, Mn(O, J. Phys. Chem. A, 1997, 101, 45, 8547, https://doi.org/10.1021/jp971813l . [all data]

Jacox, 2003
Jacox, M.E., Vibrational and electronic energy levels of polyatomic transient molecules: supplement B, J. Phys. Chem. Ref. Data, 2003, 32, 1, 1-441, https://doi.org/10.1063/1.1497629 . [all data]