cyc-LuNN

Vibrational and/or electronic energy levels

Data compiled by: Marilyn E. Jacox

State:   X

Vib.
sym.
 No.   Approximate
 type of mode
 cm-1   Med.   Method   References

a1 1 NN stretch 1845.3 Ar IR Willson and Andrews, 1999
1 NN stretch 1840.2 Ar IR Willson and Andrews, 1999
1 NN stretch 1836.0 Ar IR Willson and Andrews, 1999
1 NN stretch 1824.3 Ar IR Willson and Andrews, 1999
1 NN stretch 1852.0 N2 IR Willson and Andrews, 1999
1 NN stretch 1848.9 N2 IR Willson and Andrews, 1999
1 NN stretch 1846.0 N2 IR Willson and Andrews, 1999
1 NN stretch 1844.2 N2 IR Willson and Andrews, 1999
1 NN stretch 1839.5 N2 IR Willson and Andrews, 1999

Additional references: Jacox, 2003, page 75

References

Willson and Andrews, 1999
Willson, S.P.; Andrews, L., Characterization of the Reaction Products of Laser-Ablated Late Lanthanide Metal Atoms with Dinitrogen. Matrix IR Spectra of LnN, (LnN), J. Phys. Chem. A, 1999, 103, 10, 1311, https://doi.org/10.1021/jp984181r . [all data]

Jacox, 2003
Jacox, M.E., Vibrational and electronic energy levels of polyatomic transient molecules: supplement B, J. Phys. Chem. Ref. Data, 2003, 32, 1, 1-441, https://doi.org/10.1063/1.1497629 . [all data]