Li2Na2

Vibrational and/or electronic energy levels

Data compiled by: Marilyn E. Jacox

State:   3 1B1u

 Energy
 (cm-1
 Med.   Transition   λmin
 (nm)
 λmax
 (nm)

References

Tx = 23300 gas Pollack, Wang, et al., 1992

State:   2 1B1u

 Energy
 (cm-1
 Med.   Transition   λmin
 (nm)
 λmax
 (nm)

Tx = 23300 gas Pollack, Wang, et al., 1992

State:   3 1B2u

 Energy
 (cm-1
 Med.   Transition   λmin
 (nm)
 λmax
 (nm)

Tx = 21400 gas Pollack, Wang, et al., 1992

State:   2 1B2u

 Energy
 (cm-1
 Med.   Transition   λmin
 (nm)
 λmax
 (nm)

Tx = 21400 gas Pollack, Wang, et al., 1992

State:   1 1B1u

 Energy
 (cm-1
 Med.   Transition   λmin
 (nm)
 λmax
 (nm)

Tx = 19100 gas Pollack, Wang, et al., 1992

State:   2 1B3u

 Energy
 (cm-1
 Med.   Transition   λmin
 (nm)
 λmax
 (nm)

Tx = 16300 gas Pollack, Wang, et al., 1992

State:   1 1B3u

 Energy
 (cm-1
 Med.   Transition   λmin
 (nm)
 λmax
 (nm)

Tx = 14300 gas Pollack, Wang, et al., 1992

Additional references: Jacox, 1994, page 180

Pollack, Wang, et al., 1992
Pollack, S.; Wang, C.R.C.; Dahlseid, T.A.; Kappes, M.M., Optical absorption probes of LixNa4-x (x=1,2): Geometry, substitution isomers, and composition-dependent electron delocalization, J. Chem. Phys., 1992, 96, 7, 4918, https://doi.org/10.1063/1.462788 . [all data]

Jacox, 1994
Jacox, M.E., Vibrational and electronic energy levels of polyatomic transient molecules, American Chemical Society, Washington, DC, 1994, 464. [all data]