t-LiOONO

Vibrational and/or electronic energy levels

Data compiled by: Marilyn E. Jacox

State:   X

Vib.
sym.
 No.   Approximate
 type of mode
 cm-1   Med.   Method   References

1 N=O stretch 1581.6 Ar IR Lo, Lee, et al., 1995
1 N=O stretch 1580.4 Ar IR Lo, Lee, et al., 1995
Mixed 998.3 Ar IR Lo, Lee, et al., 1995
Mixed 995.6 Ar IR Lo, Lee, et al., 1995
LiO stretch 647.7 Ar IR Lo, Lee, et al., 1995
LiO stretch 645.0 Ar IR Lo, Lee, et al., 1995
OO stretch 600.4 Ar IR Lo, Lee, et al., 1995

Additional references: Jacox, 1998, page 295

References

Lo, Lee, et al., 1995
Lo, W.-J.; Lee, Y.-P.; Tsai, J.-H.M.; Tsai, H.-H.; Hamilton, T.P.; Harrison, J.G.; Beckman, J.S., Infrared absorption of cis- and trans-alkali-metal peroxynitrites (MOONO, M=Li, Na, and K) in solid argon, J. Chem. Phys., 1995, 103, 10, 4026, https://doi.org/10.1063/1.469588 . [all data]

Jacox, 1998
Jacox, M.E., Vibrational and electronic energy levels of polyatomic transient molecules: supplement A, J. Phys. Chem. Ref. Data, 1998, 27, 2, 115-393, https://doi.org/10.1063/1.556017 . [all data]