(cyc-O2La)O2

Vibrational and/or electronic energy levels

Data compiled by: Marilyn E. Jacox

State:   X

Vib.
sym.
 No.   Approximate
 type of mode
 cm-1   Med.   Method   References

OO stretch 1111.1 Ar IR Andrews, Zhou, et al., 1999
OLaO a-stretch 602.9 Ar IR Andrews, Zhou, et al., 1999

References

Andrews, Zhou, et al., 1999
Andrews, L.; Zhou, M.; Chertihin, G.V.; Bauschlicher, C.W., Jr., Reactions of Laser-Ablated Y and La Atoms, Cations and Electrons with O, J. Phys. Chem. A, 1999, 103, 33, 6525, https://doi.org/10.1021/jp991024z . [all data]