OLaO-

Vibrational and/or electronic energy levels

Data compiled by: Marilyn E. Jacox

State:   X

Vib.
sym.
 No.   Approximate
 type of mode
 cm-1   Med.   Method   References

a1 1 Sym. stretch 656.6 Ar IR Andrews, Zhou, et al., 1999
b2 3 Asym. stretch 559.2 Ar IR Andrews, Zhou, et al., 1999

Additional references: Jacox, 2003, page 116

References

Andrews, Zhou, et al., 1999
Andrews, L.; Zhou, M.; Chertihin, G.V.; Bauschlicher, C.W., Jr., Reactions of Laser-Ablated Y and La Atoms, Cations and Electrons with O, J. Phys. Chem. A, 1999, 103, 33, 6525, https://doi.org/10.1021/jp991024z . [all data]

Jacox, 2003
Jacox, M.E., Vibrational and electronic energy levels of polyatomic transient molecules: supplement B, J. Phys. Chem. Ref. Data, 2003, 32, 1, 1-441, https://doi.org/10.1063/1.1497629 . [all data]