cyc-IrOO

Vibrational and/or electronic energy levels

Data compiled by: Marilyn E. Jacox

State:   X

Vib.
sym.
 No.   Approximate
 type of mode
 cm-1   Med.   Method   References

a1 1 OO stretch 1022.7 Ar IR Citra and Andrews, 1999

Additional references: Jacox, 2003, page 106

References

Citra and Andrews, 1999
Citra, A.; Andrews, L., Reactions of Laser-Ablated Iridium Atoms with O, J. Phys. Chem. A, 1999, 103, 21, 4182, https://doi.org/10.1021/jp990388o . [all data]

Jacox, 2003
Jacox, M.E., Vibrational and electronic energy levels of polyatomic transient molecules: supplement B, J. Phys. Chem. Ref. Data, 2003, 32, 1, 1-441, https://doi.org/10.1063/1.1497629 . [all data]