cyc-InO2-

Vibrational and/or electronic energy levels

Data compiled by: Marilyn E. Jacox

State:   X

Vib.
sym.
 No.   Approximate
 type of mode
 cm-1   Med.   Method   References

a1 462.4 Ar IR Burkholder, Yustein, et al., 1992
Andrews, Kushto, et al., 1997

Additional references: Jacox, 2003, page 130

References

Burkholder, Yustein, et al., 1992
Burkholder, T.R.; Yustein, J.T.; Andrews, L., Reactions of pulsed laser evaporated gallium and indium atoms with molecular oxygen: matrix infrared spectra of new gallium dioxide and indium dioxide species, J. Phys. Chem., 1992, 96, 25, 10189, https://doi.org/10.1021/j100204a019 . [all data]

Andrews, Kushto, et al., 1997
Andrews, L.; Kushto, G.P.; Yustein, J.T.; Archibong, E.; Sullivan, R.; Leszczynski, J., Reactions of Pulsed-Laser-Evaporated Thallium Atoms with O, J. Phys. Chem. A, 1997, 101, 48, 9077, https://doi.org/10.1021/jp9723325 . [all data]

Jacox, 2003
Jacox, M.E., Vibrational and electronic energy levels of polyatomic transient molecules: supplement B, J. Phys. Chem. Ref. Data, 2003, 32, 1, 1-441, https://doi.org/10.1063/1.1497629 . [all data]