OHoO

Vibrational and/or electronic energy levels

Data compiled by: Marilyn E. Jacox

State:   X

Vib.
sym.
 No.   Approximate
 type of mode
 cm-1   Med.   Method   References

a1 1 Sym. stretch 668.2 Ne IR Willson and Andrews, 1999
1 Sym. stretch 649.2 Ar IR Willson and Andrews, 1999
b2 3 Asym. stretch 548.8 Ar IR Willson and Andrews, 1999

Additional references: Jacox, 2003, page 110

References

Willson and Andrews, 1999
Willson, S.P.; Andrews, L., Characterization of the Reaction Products of Laser-Ablated Late Lanthanide Metal Atoms with Molecular Oxygen: Infrared Spectra of LnO, LnO, J. Phys. Chem. A, 1999, 103, 35, 6972, https://doi.org/10.1021/jp991338m . [all data]

Jacox, 2003
Jacox, M.E., Vibrational and electronic energy levels of polyatomic transient molecules: supplement B, J. Phys. Chem. Ref. Data, 2003, 32, 1, 1-441, https://doi.org/10.1063/1.1497629 . [all data]