Mn2H4

Vibrational and/or electronic energy levels

Data compiled by: Marilyn E. Jacox

State:   X

Vib.
sym.
 No.   Approximate
 type of mode
 cm-1   Med.   Method   References

1344 Ne IR Wang and Andrews, 2003
1334.9 H2 IR Wang and Andrews, 2003

References

Wang and Andrews, 2003
Wang, X.; Andrews, L., Matrix Infrared Spectra and Density Functional Theory Calculations of Manganese and Rhenium Hydrides, J. Phys. Chem. A, 2003, 107, 20, 4081, https://doi.org/10.1021/jp034392i . [all data]