LaH4-

Vibrational and/or electronic energy levels

Data compiled by: Marilyn E. Jacox

State:   X

Vib.
sym.
 No.   Approximate
 type of mode
 cm-1   Med.   Method   References

f2 3 LaH stretch 1101.8 Ne IR Wang and Andrews, 2002
Wang, Chertihin, et al., 2002
3 LaH stretch 1114.3 Ar IR Wang and Andrews, 2002
Wang, Chertihin, et al., 2002

References

Wang and Andrews, 2002
Wang, X.; Andrews, L., Homoleptic Tetrahydrometalate Anions MH, J. Am. Chem. Soc., 2002, 124, 25, 7610, https://doi.org/10.1021/ja020112l . [all data]

Wang, Chertihin, et al., 2002
Wang, X.; Chertihin, G.V.; Andrews, L., Matrix Infrared Spectra and DFT Calculations of the Reactive MH, J. Phys. Chem. A, 2002, 106, 40, 9213, https://doi.org/10.1021/jp026166z . [all data]