SiH3HgH

Vibrational and/or electronic energy levels

Data compiled by: Marilyn E. Jacox

State:   X

Vib.
sym.
 No.   Approximate
 type of mode
 cm-1   Med.   Method   References

HgH stretch 1886.7 Ar IR Legay-Sommaire and Legay, 1998
Macrae, Greene, et al., 2004
HgH stretch 1865.4 Kr IR Legay-Sommaire and Legay, 1998
HgH stretch 1873.7 N2 IR Legay-Sommaire and Legay, 1998
867.8 Ar IR Legay-Sommaire and Legay, 1998
Macrae, Greene, et al., 2004
864.4 Kr IR Legay-Sommaire and Legay, 1998
867.8 N2 IR Legay-Sommaire and Legay, 1998

Additional references: Jacox, 2003, page 309

References

Legay-Sommaire and Legay, 1998
Legay-Sommaire, N.; Legay, F., Photochemical Insertion Reaction of Hg in SiH, J. Phys. Chem. A, 1998, 102, 45, 8759, https://doi.org/10.1021/jp9821533 . [all data]

Macrae, Greene, et al., 2004
Macrae, V.A.; Greene, T.M.; Downs, A.J., Matrix Reactivity of Zn, Cd, or Hg Atoms (M) in the Presence of Silane: Photogeneration and Characterization of the Insertion Product HMSiH, J. Phys. Chem. A, 2004, 108, 8, 1393, https://doi.org/10.1021/jp0309769 . [all data]

Jacox, 2003
Jacox, M.E., Vibrational and electronic energy levels of polyatomic transient molecules: supplement B, J. Phys. Chem. Ref. Data, 2003, 32, 1, 1-441, https://doi.org/10.1063/1.1497629 . [all data]