TlH3

Vibrational and/or electronic energy levels

Data compiled by: Marilyn E. Jacox

State:   X

Vib.
sym.
 No.   Approximate
 type of mode
 cm-1   Med.   Method   References

e' 3 TlH3 stretch 1748.4 H2 IR Andrews and Wang, 2004
Wang and Andrews, 2004

References

Andrews and Wang, 2004
Andrews, L.; Wang, X., Infrared Spectra of Indium Hydrides in Solid Hydrogen and of Solid Indane, Angew. Chem. Int. Ed., 2004, 43, 13, 1706, https://doi.org/10.1002/anie.200353216 . [all data]

Wang and Andrews, 2004
Wang, X.; Andrews, L., Infrared Spectra of Thallium Hydrides in Solid Neon, Hydrogen, and Argon, J. Phys. Chem. A, 2004, 108, 16, 3396, https://doi.org/10.1021/jp0498973 . [all data]