PbH3-

Vibrational and/or electronic energy levels

Data compiled by: Marilyn E. Jacox

State:   X

Vib.
sym.
 No.   Approximate
 type of mode
 cm-1   Med.   Method   References

e 3 Asym. stretch 1400 Ne IR Wang, Andrews, et al., 2002
3 Asym. stretch 1383 H2 IR Wang and Andrews, 2003

References

Wang, Andrews, et al., 2002
Wang, X.; Andrews, L.; Chertihin, G.V.; Souter, P.F., Infrared Spectra of the Novel Sn, J. Phys. Chem. A, 2002, 106, 26, 6302, https://doi.org/10.1021/jp025763i . [all data]

Wang and Andrews, 2003
Wang, X.; Andrews, L., Infrared Spectra of Group 14 Hydrides in Solid Hydrogen: Experimental Observation of PbH, J. Am. Chem. Soc., 2003, 125, 21, 6581, https://doi.org/10.1021/ja029862l . [all data]