HSiPH2

Vibrational and/or electronic energy levels

Data compiled by: Marilyn E. Jacox

State:   X

Vib.
sym.
 No.   Approximate
 type of mode
 cm-1   Med.   Method   References

1 PH2 a-stretch 2379.8 w Ar IR Glatthaar and Maier, 2004
2 PH2 s-stretch 2360.6 w Ar IR Glatthaar and Maier, 2004
4 SiH stretch 2001.5 s Ar IR Glatthaar and Maier, 2004
4 PH2 scissors 1080.6 w Ar IR Glatthaar and Maier, 2004
5 Deformation 801.0 m Ar IR Glatthaar and Maier, 2004

References

Glatthaar and Maier, 2004
Glatthaar, J.; Maier, G., Reaction of Atomic Silicon with Phosphane: A Matrix-Spectroscopic Study, Angew. Chem. Int. Ed., 2004, 43, 10, 1294, https://doi.org/10.1002/anie.200353111 . [all data]