HSc(OH)2

Vibrational and/or electronic energy levels

Data compiled by: Marilyn E. Jacox

State:   X

Vib.
sym.
 No.   Approximate
 type of mode
 cm-1   Med.   Method   References

ScH stretch 1418.3 w T Ar IR Zhang, Dong, et al., 2000
ScO2 a-stretch 729.6 T Ar IR Kauffman, Hauge, et al., 1985
Zhang, Dong, et al., 2000

Additional references: Jacox, 2003, page 318

References

Zhang, Dong, et al., 2000
Zhang, L.; Dong, J.; Zhou, M., Matrix-Isolation Fourier Transform Infrared and Theoretical Studies of Laser-Ablated Sc Atom Reactions with Water Molecules, J. Phys. Chem. A, 2000, 104, 39, 8882, https://doi.org/10.1021/jp001836r . [all data]

Kauffman, Hauge, et al., 1985
Kauffman, J.W.; Hauge, R.H.; Margrave, J.L., Reactions of atomic scandium, titanium, and vanadium with molecular water at 15 K, J. Phys. Chem., 1985, 89, 16, 3547, https://doi.org/10.1021/j100262a024 . [all data]

Jacox, 2003
Jacox, M.E., Vibrational and electronic energy levels of polyatomic transient molecules: supplement B, J. Phys. Chem. Ref. Data, 2003, 32, 1, 1-441, https://doi.org/10.1063/1.1497629 . [all data]