InNH3+

Vibrational and/or electronic energy levels

Data compiled by: Marilyn E. Jacox

State:   X

Vib.
sym.
 No.   Approximate
 type of mode
 cm-1   Med.   Method   References

a1 3 InN stretch 234 gas TPE Rothschopf, Perkins, et al., 2000

Additional references: Jacox, 2003, page 251

References

Rothschopf, Perkins, et al., 2000
Rothschopf, G.K.; Perkins, J.S.; Li, S.; Yang, D.-S., Zero Electron Kinetic Energy Spectroscopy and Theoretical Calculations of InNH, J. Phys. Chem. A, 2000, 104, 35, 3178, https://doi.org/10.1021/jp001916v . [all data]

Jacox, 2003
Jacox, M.E., Vibrational and electronic energy levels of polyatomic transient molecules: supplement B, J. Phys. Chem. Ref. Data, 2003, 32, 1, 1-441, https://doi.org/10.1063/1.1497629 . [all data]