HfH3

Vibrational and/or electronic energy levels

Data compiled by: Marilyn E. Jacox

State:   X

Vib.
sym.
 No.   Approximate
 type of mode
 cm-1   Med.   Method   References

HfH stretch 1646 Ar IR Chertihin and Andrews, 1995

Additional references: Jacox, 1998, page 211

References

Chertihin and Andrews, 1995
Chertihin, G.V.; Andrews, L., Reactions of laser-ablated Zr and Hf atoms with hydrogen. Matrix infrared spectra of the MH, MH2, MH3, and MH4 molecules, J. Phys. Chem., 1995, 99, 41, 15004, https://doi.org/10.1021/j100041a014 . [all data]

Jacox, 1998
Jacox, M.E., Vibrational and electronic energy levels of polyatomic transient molecules: supplement A, J. Phys. Chem. Ref. Data, 1998, 27, 2, 115-393, https://doi.org/10.1063/1.556017 . [all data]