TlTlH2

Vibrational and/or electronic energy levels

Data compiled by: Marilyn E. Jacox

State:   X

Vib.
sym.
 No.   Approximate
 type of mode
 cm-1   Med.   Method   References

TlH2 stretch 1431.7 Ne IR Wang and Andrews, 2004
TlH2 stretch 1424.3 H2 IR Wang and Andrews, 2004

References

Wang and Andrews, 2004
Wang, X.; Andrews, L., Infrared Spectra of Thallium Hydrides in Solid Neon, Hydrogen, and Argon, J. Phys. Chem. A, 2004, 108, 16, 3396, https://doi.org/10.1021/jp0498973 . [all data]