RhH2

Vibrational and/or electronic energy levels

Data compiled by: Marilyn E. Jacox

State:   X

Vib.
sym.
 No.   Approximate
 type of mode
 cm-1   Med.   Method   References

a1 1 Sym. stretch 2099.7 Ne IR Wang and Andrews, 2002
1 Sym. stretch 2099.4 Ar IR Wang and Andrews, 2002
b2 3 Asym. stretch 2052.2 Ne IR Wang and Andrews, 2002
3 Asym. stretch 2053.4 Ar IR Wang and Andrews, 2002

References

Wang and Andrews, 2002
Wang, X.; Andrews, L., Infrared Spectra of Rhodium Hydrides in Solid Argon, Neon, and Deuterium with Supporting Density Functional Calculations, J. Phys. Chem. A, 2002, 106, 15, 3706, https://doi.org/10.1021/jp013624f . [all data]