HTh(O)OH

Vibrational and/or electronic energy levels

Data compiled by: Marilyn E. Jacox

State:   X

Vib.
sym.
 No.   Approximate
 type of mode
 cm-1   Med.   Method   References

ThH stretch 1341.0 Ar IR Liang, Andrews, et al., 2002
Th=O stretch 804.0 Ar IR Liang, Andrews, et al., 2002
ThO stretch 542.6 Ar IR Liang, Andrews, et al., 2002

References

Liang, Andrews, et al., 2002
Liang, B.; Andrews, L.; Li, J.; Bursten, B.E., Experimental and Theoretical Studies of the Products of Laser-Ablated Thorium Atom Reactions with H, J. Am. Chem. Soc., 2002, 124, 23, 6723, https://doi.org/10.1021/ja012593z . [all data]