HZnOH

Vibrational and/or electronic energy levels

Data compiled by: Marilyn E. Jacox

State:   X

Vib.
sym.
 No.   Approximate
 type of mode
 cm-1   Med.   Method   References

a' 1 OH stretch 3691.7 Ar IR Wang and Andrews, 2005
1 OH stretch 3694.0 H2 IR Wang and Andrews, 2005
2 HZn stretch 1966.2 Ne IR Wang and Andrews, 2004
2 HZn stretch 1955.0 Ar IR Greene, Brown, et al., 1995
Macrae, Greene, et al., 2004
Macrae, Greene, et al., 2004, 2
Wang and Andrews, 2005
2 HZn stretch 1965.8 p-H2 IR Wang and Andrews, 2004
2 HZn stretch 1963.2 H2 IR Wang and Andrews, 2004
Wang and Andrews, 2005
3 Mixed 701.3 Ar IR Macrae, Greene, et al., 2004, 2
4 Mixed 660.0 Ar IR Greene, Brown, et al., 1995
Macrae, Greene, et al., 2004, 2
Wang and Andrews, 2005
4 Mixed 665.7 H2 IR Wang and Andrews, 2005
5 Deformation 453.3 Ar IR Greene, Brown, et al., 1995
Macrae, Greene, et al., 2004, 2
5 Deformation 477.7 H2 IR Wang and Andrews, 2005
a 6 OPLA 483.1 Ar IR Macrae, Greene, et al., 2004, 2
6 OPLA 482.5 H2 IR Wang and Andrews, 2005

Additional references: Jacox, 1998, page 222

References

Wang and Andrews, 2005
Wang, X.; Andrews, L., Zinc and Cadmium Dihydroxide Molecules: Matrix Infrared Spectra and Theoretical Calculations, J. Phys. Chem. A, 2005, 109, 17, 3849, https://doi.org/10.1021/jp050362z . [all data]

Wang and Andrews, 2004
Wang, X.; Andrews, L., Infrared Spectra of Zn and Cd Hydride Molecules and Solids, J. Phys. Chem. A, 2004, 108, 50, 11006, https://doi.org/10.1021/jp046414m . [all data]

Greene, Brown, et al., 1995
Greene, T.M.; Brown, W.; Andrews, L.; Downs, A.J.; Chertihin, G.V.; Runeberg, N.; Pyykko, P., Matrix Infrared Spectroscopic and ab Initio Studies of ZnH2, CdH2, and Related Metal Hydride Species, J. Phys. Chem., 1995, 99, 20, 7925, https://doi.org/10.1021/j100020a014 . [all data]

Macrae, Greene, et al., 2004
Macrae, V.A.; Greene, T.M.; Downs, A.J., Matrix Reactivity of Zn, Cd, or Hg Atoms (M) in the Presence of Silane: Photogeneration and Characterization of the Insertion Product HMSiH, J. Phys. Chem. A, 2004, 108, 8, 1393, https://doi.org/10.1021/jp0309769 . [all data]

Macrae, Greene, et al., 2004, 2
Macrae, V.A.; Greene, T.M.; Downs, A.J., Matrix studies of the thermal and photolytic reactions of Zn, Cd and Hg (M) atoms with H2O: formation and characterisation of the adduct M?OH2 and photoproduct HMOHElectronic supplementary information (ESI) available: IR spectra of a matrix containing Hg and D2O (Fig. S1); calculated and observed IR spectra for M?OH2 species (M = Zn, Cd or Hg) (Table S1). See http://www.rsc.org/suppdata/cp/b4/b405300a/, Phys. Chem. Chem. Phys., 2004, 6, 19, 4586, https://doi.org/10.1039/b405300a . [all data]

Jacox, 1998
Jacox, M.E., Vibrational and electronic energy levels of polyatomic transient molecules: supplement A, J. Phys. Chem. Ref. Data, 1998, 27, 2, 115-393, https://doi.org/10.1063/1.556017 . [all data]