HYOH+

Vibrational and/or electronic energy levels

Data compiled by: Marilyn E. Jacox

State:   X

Vib.
sym.
 No.   Approximate
 type of mode
 cm-1   Med.   Method   References

YH stretch 1534.2 Ar IR Zhang, Shao, et al., 2001
YO stretch 695.1 Ar IR Zhang, Shao, et al., 2001

Additional references: Jacox, 2003, page 164

References

Zhang, Shao, et al., 2001
Zhang, L.; Shao, L.; Zhou, M., Reactions of laser-ablated Y and La atoms with H2O Infrared spectra and density functional calculations of the HMO, HMOH and M(OH)2 molecules in solid argon, Chem. Phys., 2001, 272, 1, 27, https://doi.org/10.1016/S0301-0104(01)00450-5 . [all data]

Jacox, 2003
Jacox, M.E., Vibrational and electronic energy levels of polyatomic transient molecules: supplement B, J. Phys. Chem. Ref. Data, 2003, 32, 1, 1-441, https://doi.org/10.1063/1.1497629 . [all data]