Mn(OH)2

Vibrational and/or electronic energy levels

Data compiled by: Marilyn E. Jacox

State:   X

Vib.
sym.
 No.   Approximate
 type of mode
 cm-1   Med.   Method   References

b 6 OH a-stretch 3735.2 Ar IR Wang and Andrews, 2006
7 MnO2 a-stretch 709.6 Ar IR Zhou, Zhang, et al., 2001
Wang and Andrews, 2006
8 MnOH bend 435.4 Ar IR Wang and Andrews, 2006

Additional references: Jacox, 2003, page 265

References

Wang and Andrews, 2006
Wang, X.; Andrews, L., Infrared Spectra of M(OH), J. Phys. Chem. A, 2006, 110, 33, 10035, https://doi.org/10.1021/jp0624698 . [all data]

Zhou, Zhang, et al., 2001
Zhou, M.; Zhang, L.; Shao, L.; Wang, W.; Fan, K.; Qin, Q., Reactions of Mn with H, J. Phys. Chem. A, 2001, 105, 24, 5801, https://doi.org/10.1021/jp0043118 . [all data]

Jacox, 2003
Jacox, M.E., Vibrational and electronic energy levels of polyatomic transient molecules: supplement B, J. Phys. Chem. Ref. Data, 2003, 32, 1, 1-441, https://doi.org/10.1063/1.1497629 . [all data]