Si4H

Vibrational and/or electronic energy levels

Data compiled by: Marilyn E. Jacox

State:   X

Vib.
sym.
 No.   Approximate
 type of mode
 cm-1   Med.   Method   References

a' 310 ± 20 gas PE Xu, Taylor, et al., 1998

Additional references: Jacox, 2003, page 272

References

Xu, Taylor, et al., 1998
Xu, C.; Taylor, T.R.; Burton, G.R.; Neumark, D.M., Photoelectron Spectroscopy of SinH- (n=2-4) Anions, J. Chem. Phys., 1998, 108, 18, 7645, https://doi.org/10.1063/1.476200 . [all data]

Jacox, 2003
Jacox, M.E., Vibrational and electronic energy levels of polyatomic transient molecules: supplement B, J. Phys. Chem. Ref. Data, 2003, 32, 1, 1-441, https://doi.org/10.1063/1.1497629 . [all data]