Sb2H

Vibrational and/or electronic energy levels

Data compiled by: Marilyn E. Jacox

State:   X

Vib.
sym.
 No.   Approximate
 type of mode
 cm-1   Med.   Method   References

SbH stretch 1814.6 Ne IR Wang, Souter, et al., 2003
SbH stretch 1817.9 H2 IR Wang, Souter, et al., 2003
SbH stretch 1815.1 H2 IR Wang, Souter, et al., 2003

References

Wang, Souter, et al., 2003
Wang, X.; Souter, P.F.; Andrews, L., Infrared Spectra of Antimony and Bismuth Hydrides in Solid Matrixes, J. Phys. Chem. A, 2003, 107, 21, 4244, https://doi.org/10.1021/jp034379y . [all data]