HSPS2

Vibrational and/or electronic energy levels

Data compiled by: Marilyn E. Jacox

State:   X

Vib.
sym.
 No.   Approximate
 type of mode
 cm-1   Med.   Method   References

SH stretch 2571.3 Ar IR Mielke and Andrews, 1993
Mixed 861.2 Ar IR Mielke and Andrews, 1993
Mixed 765.7 Ar IR Mielke and Andrews, 1993
Mixed 647.2 Ar IR Mielke and Andrews, 1993

Additional references: Jacox, 1998, page 292

References

Mielke and Andrews, 1993
Mielke, Z.; Andrews, L., Infrared spectra of phosphorus thiohydrides (HSPH2, HPS2, and HSPS2) in solid argon, J. Phys. Chem., 1993, 97, 17, 4313, https://doi.org/10.1021/j100119a011 . [all data]

Jacox, 1998
Jacox, M.E., Vibrational and electronic energy levels of polyatomic transient molecules: supplement A, J. Phys. Chem. Ref. Data, 1998, 27, 2, 115-393, https://doi.org/10.1063/1.556017 . [all data]