HSO2

Vibrational and/or electronic energy levels

Data compiled by: Marilyn E. Jacox

State:   ?

 Energy
 (cm-1
 Med.   Transition   λmin
 (nm)
 λmax
 (nm)

References

Td = 17240 Ar Isoniemi, Khriachtchev, et al., 2002

State:   ?

 Energy
 (cm-1
 Med.   Transition   λmin
 (nm)
 λmax
 (nm)

Td = 17240 Kr Isoniemi, Khriachtchev, et al., 2002

State:   ?

 Energy
 (cm-1
 Med.   Transition   λmin
 (nm)
 λmax
 (nm)

Td = 17240 Xe Isoniemi, Khriachtchev, et al., 2002

State:   X

Vib.
sym.
 No.   Approximate
 type of mode
 cm-1   Med.   Method   References

a1 1 SH stretch 2159 Ar IR Isoniemi, Khriachtchev, et al., 2002
1 SH stretch 2154 w m Ar IR Isoniemi, Khriachtchev, et al., 2002
1 SH stretch 2142 w m Kr IR Isoniemi, Khriachtchev, et al., 2001
Isoniemi, Khriachtchev, et al., 2002
1 SH stretch 2121 Xe IR Isoniemi, Khriachtchev, et al., 2002
1 SH stretch 2117 w m Xe IR Isoniemi, Khriachtchev, et al., 2002
2 SO2 s-stretch 1077 w m Ar IR Isoniemi, Khriachtchev, et al., 2002
2 SO2 s-stretch 1074 w m Kr IR Isoniemi, Khriachtchev, et al., 2001
Isoniemi, Khriachtchev, et al., 2002
2 SO2 s-stretch 1070 T Xe IR Isoniemi, Khriachtchev, et al., 2002
3 SO2 scissors 466 w m Ar IR Isoniemi, Khriachtchev, et al., 2002
3 SO2 scissors 465 w m Kr IR Isoniemi, Khriachtchev, et al., 2001
Isoniemi, Khriachtchev, et al., 2002
3 SO2 scissors 463 w m Xe IR Isoniemi, Khriachtchev, et al., 2002
b1 4 OPLA 797 w Kr IR Isoniemi, Khriachtchev, et al., 2001
Isoniemi, Khriachtchev, et al., 2002
4 OPLA 789 w m Xe IR Isoniemi, Khriachtchev, et al., 2002
b2 5 SO2 a-stretch 1285 vs Ar IR Isoniemi, Khriachtchev, et al., 2002
5 SO2 a-stretch 1281 vs Kr IR Isoniemi, Khriachtchev, et al., 2001
Isoniemi, Khriachtchev, et al., 2002
5 SO2 a-stretch 1274 vs Xe IR Isoniemi, Khriachtchev, et al., 2002
6 HSO deform. 958 Kr IR Isoniemi, Khriachtchev, et al., 2002
6 HSO deform. 948 Xe IR Isoniemi, Khriachtchev, et al., 2002

Isoniemi, Khriachtchev, et al., 2002
Isoniemi, E.; Khriachtchev, L.; Lundell, J.; Rasanen, M., HSO2 isomers in rare-gas solids, Phys. Chem. Chem. Phys., 2002, 4, 9, 1549, https://doi.org/10.1039/b110109a . [all data]

Isoniemi, Khriachtchev, et al., 2001
Isoniemi, E.; Khriachtchev, L.; Lundell, J.; Rasanen, M., Photochemistry of H2S/SO2 mixtures in solid krypton, J. Mol. Struct., 2001, 563/564, 261, https://doi.org/10.1016/S0022-2860(00)00843-7 . [all data]