HN4+

Vibrational and/or electronic energy levels

Data compiled by: Marilyn E. Jacox

State:   X

Vib.
sym.
 No.   Approximate
 type of mode
 cm-1   Med.   Method   References

Σu+ 3 NN a-stretch 2352.24 gas DL Verdes, Linnartz, et al., 1999

References

Verdes, Linnartz, et al., 1999
Verdes, D.; Linnartz, H.; Maier, J.P.; Botschwina, P.; Oswald, R.; Rosmus, P.; Knowles, P.J., Spectroscopic and theoretical characterization of linear centrosymmetric N[Triple Bond]N••H[sup +]••N[Triple Bond]N, J. Chem. Phys., 1999, 111, 18, 8400, https://doi.org/10.1063/1.480181 . [all data]