Ge2O3-

Vibrational and/or electronic energy levels

Data compiled by: Marilyn E. Jacox

State:   ?

 Energy
 (cm-1
 Med.   Transition   λmin
 (nm)
 λmax
 (nm)

References

Td = 19610 ± 800 gas Wang, Wu, et al., 1996

Additional references: Jacox, 1998, page 300

Wang, Wu, et al., 1996
Wang, L.S.; Wu, H.; Desai, S.L.; Fan, J.; Colson, S.D., A Photoelectron Spectroscopic Study of Small Silicon Oxide Clusters: SiO2, Si2O3, and Si2O4, J. Phys. Chem., 1996, 100, 21, 8697, https://doi.org/10.1021/jp9602538 . [all data]

Jacox, 1998
Jacox, M.E., Vibrational and electronic energy levels of polyatomic transient molecules: supplement A, J. Phys. Chem. Ref. Data, 1998, 27, 2, 115-393, https://doi.org/10.1063/1.556017 . [all data]