Ge2H4

Vibrational and/or electronic energy levels

Data compiled by: Marilyn E. Jacox

State:   X

Vib.
sym.
 No.   Approximate
 type of mode
 cm-1   Med.   Method   References

2053 w Ne IR Wang, Andrews, et al., 2002
2035 H2 IR Wang and Andrews, 2003
2035 w Ne IR Wang, Andrews, et al., 2002
2009 H2 IR Wang and Andrews, 2003
789.1 Ne IR Wang, Andrews, et al., 2002
787 Ar IR Wang, Andrews, et al., 2002

References

Wang, Andrews, et al., 2002
Wang, X.; Andrews, L.; Kushto, G.P., Infrared Spectra of the Novel Ge, J. Phys. Chem. A, 2002, 106, 24, 5809, https://doi.org/10.1021/jp020219v . [all data]

Wang and Andrews, 2003
Wang, X.; Andrews, L., Infrared Spectra of Group 14 Hydrides in Solid Hydrogen: Experimental Observation of PbH, J. Am. Chem. Soc., 2003, 125, 21, 6581, https://doi.org/10.1021/ja029862l . [all data]