HGeNH2

Vibrational and/or electronic energy levels

Data compiled by: Marilyn E. Jacox

State:   X

Vib.
sym.
 No.   Approximate
 type of mode
 cm-1   Med.   Method   References

GeH stretch 1793.3 Ar IR Chen, Zheng, et al., 2002
NH2 deform. 863.2 Ar IR Chen, Zheng, et al., 2002
GeN stretch 692.8 Ar IR Chen, Zheng, et al., 2002
NH2 wag 474.0 Ar IR Chen, Zheng, et al., 2002

References

Chen, Zheng, et al., 2002
Chen, M.; Zheng, A.; Lu, H.; Zhou, M., Reactions of Atomic Silicon and Germanium with Ammonia: A Matrix-Isolation FTIR and Theoretical Study, J. Phys. Chem. A, 2002, 106, 13, 3077, https://doi.org/10.1021/jp012928z . [all data]