HGeI

Vibrational and/or electronic energy levels

Data compiled by: Marilyn E. Jacox

State:   A

 Energy
 (cm-1
 Med.   Transition   λmin
 (nm)
 λmax
 (nm)

References

To = 18929.29 gas A-X 482 720 Harper, Klusek, et al., 1998
Tackett, Li, et al., 2006

Vib.
sym.
 No.   Approximate
 type of mode
 cm-1   Med.   Method   References

a' 1 GeH stretch 1542.5 ± 0.2 gas LF Harper, Klusek, et al., 1998
2 Bend 337.1 ± 0.2 gas LF Harper, Klusek, et al., 1998
3 GeI stretch 203.4 ± 0.2 gas LF Harper, Klusek, et al., 1998

State:   X

Vib.
sym.
 No.   Approximate
 type of mode
 cm-1   Med.   Method   References

a' 1 GeH stretch 1839 gas LF Tackett, Li, et al., 2006
2 Bend 661 gas LF Tackett, Li, et al., 2006

Additional references: Jacox, 2003, page 41

Harper, Klusek, et al., 1998
Harper, W.W.; Klusek, C.M.; Clouthier, D.J., Spectroscopic detection and characterization of iodogermylene (HGel), J. Chem. Phys., 1998, 109, 21, 9300, https://doi.org/10.1063/1.477591 . [all data]

Tackett, Li, et al., 2006
Tackett, B.S.; Li, Y.; Clouthier, D.J.; Pacheco, K.L.; Schick, G.A.; Judge, R.H., Single vibronic level emission spectroscopic studies of the ground state energy levels and molecular structures of jet-cooled HGeBr, DGeBr, HGeI, and DGeI, J. Chem. Phys., 2006, 125, 11, 114301, https://doi.org/10.1063/1.2355496 . [all data]

Jacox, 2003
Jacox, M.E., Vibrational and electronic energy levels of polyatomic transient molecules: supplement B, J. Phys. Chem. Ref. Data, 2003, 32, 1, 1-441, https://doi.org/10.1063/1.1497629 . [all data]