Ga2H6+

Vibrational and/or electronic energy levels

Data compiled by: Marilyn E. Jacox

State:   D

 Energy
 (cm-1
 Med.   Transition   λmin
 (nm)
 λmax
 (nm)

References

To = 31550 ± 120 gas Dyke, Haggerston, et al., 1996

State:   C

 Energy
 (cm-1
 Med.   Transition   λmin
 (nm)
 λmax
 (nm)

Tx = 14040 ± 240 gas Dyke, Haggerston, et al., 1996

State:   B

 Energy
 (cm-1
 Med.   Transition   λmin
 (nm)
 λmax
 (nm)

Tx = 10970 ± 240 gas Dyke, Haggerston, et al., 1996

State:   A

 Energy
 (cm-1
 Med.   Transition   λmin
 (nm)
 λmax
 (nm)

Tx = 8630 ± 240 gas Dyke, Haggerston, et al., 1996

Additional references: Jacox, 1998, page 333

Dyke, Haggerston, et al., 1996
Dyke, J.M.; Haggerston, D.; Warschkow, O.; Andrews, L.; Downs, A.J.; Souter, P.F., UV Photoelectron Spectra of the μ-Hydrido Bridge-Bonded Molecules B, J. Phys. Chem., 1996, 100, 8, 2998, https://doi.org/10.1021/jp953039c . [all data]

Jacox, 1998
Jacox, M.E., Vibrational and electronic energy levels of polyatomic transient molecules: supplement A, J. Phys. Chem. Ref. Data, 1998, 27, 2, 115-393, https://doi.org/10.1063/1.556017 . [all data]