SiH3GaH

Vibrational and/or electronic energy levels

Data compiled by: Marilyn E. Jacox

State:   ?

 Energy
 (cm-1
 Med.   Transition   λmin
 (nm)
 λmax
 (nm)

References

Td = 17240 Ar Gaertner, Himmel, et al., 2004

State:   X

Vib.
sym.
 No.   Approximate
 type of mode
 cm-1   Med.   Method   References

a' 2 SiH stretch 2123.8 Ar IR Gaertner, Himmel, et al., 2004
3 GaH stretch 1792.1 Ar IR Gaertner, Himmel, et al., 2004
3 GaH stretch 1759.0 Ar IR Gaertner, Himmel, et al., 2004
3 GaH stretch 1752.8 Ar IR Gaertner, Himmel, et al., 2004
5 Deformation 848.8 Ar IR Gaertner, Himmel, et al., 2004
5 Deformation 845.0 Ar IR Gaertner, Himmel, et al., 2004
5 Deformation 840.2 Ar IR Gaertner, Himmel, et al., 2004
a 9 SiH stretch 2117.1 Ar IR Gaertner, Himmel, et al., 2004
9 SiH stretch 2113.3 Ar IR Gaertner, Himmel, et al., 2004

Gaertner, Himmel, et al., 2004
Gaertner, B.; Himmel, H.-J.; Macrae, V.A.; Downs, A.J.; Greene, T.M., Matrix Reactivity of Al and Ga Atoms (M) in the Presence of Silane: Generation and Characterization of theη2-Coordinated Complex M•SiH4, the Insertion Product HMSiH3, and the MI Species MSiH3 in a Solid Argon Matrix, Chem. Eur. J., 2004, 10, 14, 3430, https://doi.org/10.1002/chem.200305493 . [all data]