GaPH3

Vibrational and/or electronic energy levels

Data compiled by: Marilyn E. Jacox

State:   X

Vib.
sym.
 No.   Approximate
 type of mode
 cm-1   Med.   Method   References

a' 2 PH s-stretch 2280.8 Ar IR Himmel, Downs, et al., 2001
3 PH3 a-deform. 1108.2 Ar IR Himmel, Downs, et al., 2001
4 PH3 s-deform. 973.6 Ar IR Himmel, Downs, et al., 2001

Additional references: Jacox, 2003, page 254

References

Himmel, Downs, et al., 2001
Himmel, H.-J.; Downs, A.J.; Greene, T.M., Reactions of Aluminum, Gallium, and Indium (M) Atoms with Phosphine: Generation and Characterization of the Species M·PH, Inorg. Chem., 2001, 40, 2, 396, https://doi.org/10.1021/ic000837v . [all data]

Jacox, 2003
Jacox, M.E., Vibrational and electronic energy levels of polyatomic transient molecules: supplement B, J. Phys. Chem. Ref. Data, 2003, 32, 1, 1-441, https://doi.org/10.1063/1.1497629 . [all data]