HGaNH2

Vibrational and/or electronic energy levels

Data compiled by: Marilyn E. Jacox

State:   X

Vib.
sym.
 No.   Approximate
 type of mode
 cm-1   Med.   Method   References

a' 3 GaH stretch 1721.8 Ar IR Himmel, Downs, et al., 2000
Himmel, Downs, et al., 2000, 2
4 NH2 scissors 1528.7 Ar IR Himmel, Downs, et al., 2000
Himmel, Downs, et al., 2000, 2
5 NH2 rock 746.2 Ar IR Himmel, Downs, et al., 2000
Himmel, Downs, et al., 2000, 2
6 GaN stretch 668.5 Ar IR Himmel, Downs, et al., 2000
Himmel, Downs, et al., 2000, 2
a 8 NH2 OPLA 494.1 Ar IR Himmel, Downs, et al., 2000
Himmel, Downs, et al., 2000, 2
9 GaH OPLA 210.9 Ar IR Himmel, Downs, et al., 2000
Himmel, Downs, et al., 2000, 2

Additional references: Jacox, 2003, page 252

References

Himmel, Downs, et al., 2000
Himmel, H.-J.; Downs, A.J.; Greene, T.M., Chem. Commun., 2000, 871. [all data]

Himmel, Downs, et al., 2000, 2
Himmel, H.-J.; Downs, A.J.; Greene, T.M., Thermal and Photochemical Reactions of Aluminum, Gallium, and Indium Atoms (M) in the Presence of Ammonia: Generation and Characterization of the Species M·NH, J. Am. Chem. Soc., 2000, 122, 40, 9793, https://doi.org/10.1021/ja001313x . [all data]

Jacox, 2003
Jacox, M.E., Vibrational and electronic energy levels of polyatomic transient molecules: supplement B, J. Phys. Chem. Ref. Data, 2003, 32, 1, 1-441, https://doi.org/10.1063/1.1497629 . [all data]