Fe2O5

Vibrational and/or electronic energy levels

Data compiled by: Marilyn E. Jacox

State:   A

 Energy
 (cm-1
 Med.   Transition   λmin
 (nm)
 λmax
 (nm)

References

To = 1450 ± 400 gas Wu, Desai, et al., 1996

Vib.
sym.
 No.   Approximate
 type of mode
 cm-1   Med.   Method   References

790 ± 60 gas PE Wu, Desai, et al., 1996

State:   X

Vib.
sym.
 No.   Approximate
 type of mode
 cm-1   Med.   Method   References

750 ± 50 gas PE Wu, Desai, et al., 1996

Additional references: Jacox, 2003, page 345

Wu, Desai, et al., 1996
Wu, H.; Desai, R.; Wang, L.-S., Observation and Photoelectron Spectroscopic Study of Novel Mono- and Di-iron Oxide Molecules: FeOy- (y=1-4) and Fe2Oy- (y=1-5), J. Am. Chem. Soc., 1996, 118, 22, 5296, https://doi.org/10.1021/ja954153b . [all data]

Jacox, 2003
Jacox, M.E., Vibrational and electronic energy levels of polyatomic transient molecules: supplement B, J. Phys. Chem. Ref. Data, 2003, 32, 1, 1-441, https://doi.org/10.1063/1.1497629 . [all data]