(cyc-O2Fe)OO

Vibrational and/or electronic energy levels

Data compiled by: Marilyn E. Jacox

State:   X

Vib.
sym.
 No.   Approximate
 type of mode
 cm-1   Med.   Method   References

a' 1 OO stretch 1204.5 Ar IR Gong, Zhou, et al., 2007
2 FeO2 a-stretch 975.3 Ar IR Gong, Zhou, et al., 2007
' 3 FeO2 s-stretch 871.6 Ar IR Gong, Zhou, et al., 2007

Additional references: Jacox, 1998, page 298

References

Gong, Zhou, et al., 2007
Gong, Y.; Zhou, M.; Andrews, L., Formation and Characterization of the Photochemically Interconvertible Side-On and End-On Bonded Dioxygen-Iron Dioxide Complexes in Solid Argon, J. Phys. Chem. A, 2007, 111, 47, 12001, https://doi.org/10.1021/jp0765805 . [all data]

Jacox, 1998
Jacox, M.E., Vibrational and electronic energy levels of polyatomic transient molecules: supplement A, J. Phys. Chem. Ref. Data, 1998, 27, 2, 115-393, https://doi.org/10.1063/1.556017 . [all data]