SF4-

Vibrational and/or electronic energy levels

Data compiled by: Marilyn E. Jacox

State:   X

Vib.
sym.
 No.   Approximate
 type of mode
 cm-1   Med.   Method   References

e 6 540.7 Ne IR Lugez, Jacox, et al., 1998

Additional references: Jacox, 2003, page 308

References

Lugez, Jacox, et al., 1998
Lugez, C.L.; Jacox, M.E.; King, R.A.; Schaefer, H.F., III, Experimental and ab initio study of the infrared spectra of ionic species derived from SF[sub 6] and SF[sub 4] and trapped in solid neon, J. Chem. Phys., 1998, 108, 23, 9639, https://doi.org/10.1063/1.476440 . [all data]

Jacox, 2003
Jacox, M.E., Vibrational and electronic energy levels of polyatomic transient molecules: supplement B, J. Phys. Chem. Ref. Data, 2003, 32, 1, 1-441, https://doi.org/10.1063/1.1497629 . [all data]