F3PO-

Vibrational and/or electronic energy levels

Data compiled by: Marilyn E. Jacox

State:   X

Vib.
sym.
 No.   Approximate
 type of mode
 cm-1   Med.   Method   References

a' 1 PO stretch 1200.0 m T Ne IR Lugez, Irikura, et al., 1998
2 PF stretch 768.0 m Ne IR Lugez, Irikura, et al., 1998
a 7 PF stretch 614.7 m s Ne IR Lugez, Irikura, et al., 1998

Additional references: Jacox, 2003, page 307

References

Lugez, Irikura, et al., 1998
Lugez, C.L.; Irikura, K.K.; Jacox, M.E., Experimental and ab initio study of the infrared spectra of ionic species derived from PF[sub 5], PF[sub 3], and F[sub 3]PO and trapped in solid neon, J. Chem. Phys., 1998, 108, 20, 8381, https://doi.org/10.1063/1.476304 . [all data]

Jacox, 2003
Jacox, M.E., Vibrational and electronic energy levels of polyatomic transient molecules: supplement B, J. Phys. Chem. Ref. Data, 2003, 32, 1, 1-441, https://doi.org/10.1063/1.1497629 . [all data]