cyc-(DyN)2

Vibrational and/or electronic energy levels

Data compiled by: Marilyn E. Jacox

State:   X

Vib.
sym.
 No.   Approximate
 type of mode
 cm-1   Med.   Method   References

b3u 6 701.9 Ar IR Willson and Andrews, 1999
6 678.2 N2 IR Willson and Andrews, 1999

Additional references: Jacox, 2003, page 206

References

Willson and Andrews, 1999
Willson, S.P.; Andrews, L., Characterization of the Reaction Products of Laser-Ablated Late Lanthanide Metal Atoms with Dinitrogen. Matrix IR Spectra of LnN, (LnN), J. Phys. Chem. A, 1999, 103, 10, 1311, https://doi.org/10.1021/jp984181r . [all data]

Jacox, 2003
Jacox, M.E., Vibrational and electronic energy levels of polyatomic transient molecules: supplement B, J. Phys. Chem. Ref. Data, 2003, 32, 1, 1-441, https://doi.org/10.1063/1.1497629 . [all data]